Target
Carbonic anhydrase 2
Ligand
BDBM50159807
Substrate
Meas. Tech.
ChEMBL_302729 (CHEMBL838677)
Ki
6±n/a nM
Citation
 Winum, JYPastorekova, SJakubickova, LMontero, JLScozzafava, APastorek, JVullo, DInnocenti, ASupuran, CT Carbonic anhydrase inhibitors: synthesis and inhibition of cytosolic/tumor-associated carbonic anhydrase isozymes I, II, and IX with bis-sulfamates. Bioorg Med Chem Lett 15:579-84 (2005)  
Target
Name:
Carbonic anhydrase 2
Synonyms:
CA-II CAC Carbonate dehydratase II Carbonic anhydrase 2 (CA-II) Carbonic anhydrase C Carbonic anhydrase II (CA-II) Carbonic anhydrase II (hCA II) | Carbonic anhydrase isoenzyme II (hCA II)
Type:
Enzyme
Mol. Mass.:
29250.71
Organism:
Homo sapiens (Human)
Description:
P00918
Residue:
260
  
Inhibitor
Name:
BDBM50159807
Synonyms:
CHEMBL183701 | Sulfamic acid 4-tert-butyl-2-sulfamoyloxy-phenyl ester
Type:
Small organic molecule
Emp. Form.:
C10H16N2O6S2
Mol. Mass.:
324.374
SMILES:
CC(C)(C)c1ccc(OS(N)(=O)=O)c(OS(N)(=O)=O)c1
: