Target
Carbonic anhydrase 7
Ligand
BDBM50160671
Substrate
Meas. Tech.
ChEMBL_302350 (CHEMBL828071)
Ki
4±n/a nM
Citation
 Vullo, DVoipio, JInnocenti, ARivera, CRanki, HScozzafava, AKaila, KSupuran, CT Carbonic anhydrase inhibitors. Inhibition of the human cytosolic isozyme VII with aromatic and heterocyclic sulfonamides. Bioorg Med Chem Lett 15:971-6 (2005)  
Target
Name:
Carbonic anhydrase 7
Synonyms:
CA-VII CAH7_HUMAN Carbonic anhydrase Carbonic anhydrase VII (CA VII)
Type:
Enzyme
Mol. Mass.:
29664.11
Organism:
Homo sapiens (Human)
Description:
Human cloned isozyme.
Residue:
264
  
Inhibitor
Name:
BDBM50160671
Synonyms:
Benzothiazole-2-sulfonic acid amide | CHEMBL168552
Type:
Small organic molecule
Emp. Form.:
C7H6N2O2S2
Mol. Mass.:
214.265
SMILES:
NS(=O)(=O)c1nc2ccccc2s1
: