Target
Protein farnesyltransferase subunit beta/geranylgeranyltransferase type-1 subunit alpha
Ligand
BDBM50164019
Substrate
Meas. Tech.
ChEMBL_305032 (CHEMBL831671)
IC50
2.8±n/a nM
Citation
 Lombardo, LJCamuso, AClark, JFager, KGullo-Brown, JHunt, JTInigo, IKan, DKoplowitz, BLee, FMcGlinchey, KQian, LRicca, CRovnyak, GTraeger, STokarski, JWilliams, DKWu, LIZhao, YManne, VBhide, RS Design, synthesis, and structure-activity relationships of tetrahydroquinoline-based farnesyltransferase inhibitors. Bioorg Med Chem Lett 15:1895-9 (2005)  
Target
Name:
Protein farnesyltransferase subunit beta/geranylgeranyltransferase type-1 subunit alpha
Synonyms:
Farnesyltransferase (FTase) Protein Farnesyltransferase (PFT) Chain B | Protein farnesyltransferase
Type:
Protein Complex
Mol. Mass.:
Description:
To express recombinant enzyme in E. coli, the cloned human alpha and beta subunits were co-expressed from a plasmid, in which their expression was translationally coupled.
Components:
This complex has 2 components.
Component 1
Name:
Protein farnesyltransferase subunit beta
Synonyms:
CAAX farnesyltransferase subunit alpha FNTB FTase-alpha GGTase-I-alpha Protein farnesyl/geranylgeranyl transferase Protein farnesyltransferase subunit beta Protein farnesyltransferase/geranylgeranyltransferase type-1 subunit alpha Ras proteins prenyltransferase subunit beta | Type I protein geranyl-geranyltransferase subunit alpha
Type:
Enzyme Subunit
Mol. Mass.:
48766.02
Organism:
Homo sapiens (Human)
Description:
Protein farnesyltransferase subunit beta
Residue:
437
  
Component 2
Name:
Protein farnesyltransferase/geranylgeranyltransferase type-1 subunit alpha
Synonyms:
CAAX farnesyltransferase alpha subunit FNTA_HUMAN FTase-alpha Geranylgeranyl Transferase (GGTase-I) Chain A Protein Farnesyltransferase (PFT) Chain A Protein farnesyltransferase Protein farnesyltransferase/geranylgeranyltransferase type I alpha subunit | Ras proteins prenyltransferase alpha
Type:
Enzyme
Mol. Mass.:
44392.46
Organism:
Homo sapiens (Human)
Description:
Recombinant human FTase.
Residue:
379
  
Inhibitor
Name:
BDBM50164019
Synonyms:
CHEMBL360557 | N-Benzyl-N-[6-cyano-1-(3-methyl-3H-imidazol-4-ylmethyl)-1,2,3,4-tetrahydro-quinolin-3-yl]-methanesulfonamide
Type:
Small organic molecule
Emp. Form.:
C23H25N5O2S
Mol. Mass.:
435.542
SMILES:
Cn1cncc1CN1CC(Cc2cc(ccc12)C#N)N(Cc1ccccc1)S(C)(=O)=O
: