Target
Mu-type opioid receptor
Ligand
BDBM50165050
Substrate
Meas. Tech.
ChEMBL_303068 (CHEMBL828894)
Ki
11±n/a nM
Citation
 Wentland, MPLu, QLou, RBu, YKnapp, BIBidlack, JM Synthesis and opioid receptor binding properties of a highly potent 4-hydroxy analogue of naltrexone. Bioorg Med Chem Lett 15:2107-10 (2005)  
Target
Name:
Mu-type opioid receptor
Synonyms:
M-OR-1 MOR-1 MUOR1 Mu opiate receptor OPRM1 hMOP | mu-type opioid receptor isoform MOR-1
Type:
G Protein-Coupled Receptor (GPCR)
Mol. Mass.:
44789.51
Organism:
Homo sapiens (Human)
Description:
P35372
Residue:
400
  
Inhibitor
Name:
BDBM50165050
Synonyms:
17-cyclopropylmethyl-10-hydroxy-3-methoxy-13-oxo-(1R,9R,10S)-17-azatetracyclo[7.5.3.01,10.02,7]heptadeca-2(7),3,5-triene-4-carboxamide | CHEMBL195285
Type:
Small organic molecule
Emp. Form.:
C22H28N2O4
Mol. Mass.:
384.4687
SMILES:
COc1c(ccc2C[C@H]3N(CC4CC4)CC[C@@]4(CC(=O)CC[C@@]34O)c12)C(N)=O
: