Target
Aldo-keto reductase family 1 member B1
Ligand
BDBM50154219
Substrate
Meas. Tech.
ChEMBL_305137 (CHEMBL832432)
IC50
8000±n/a nM
Citation
 Ferrari, AMWei, BQCostantino, LShoichet, BK Soft docking and multiple receptor conformations in virtual screening. J Med Chem 47:5076-84 (2004)  
Target
Name:
Aldo-keto reductase family 1 member B1
Synonyms:
AKR1B1 ALR2 Aldose reductase
Type:
PROTEIN
Mol. Mass.:
35865.31
Organism:
Sus scrofa
Description:
ChEMBL_502637
Residue:
316
  
Inhibitor
Name:
BDBM50154219
Synonyms:
1-(4-Chloro-benzyl)-5-oxo-pyrrolidine-3-carboxylic acid | CHEMBL188253
Type:
Small organic molecule
Emp. Form.:
C12H12ClNO3
Mol. Mass.:
253.682
SMILES:
OC(=O)C1CN(Cc2ccc(Cl)cc2)C(=O)C1
: