Target
Cytochrome P450 2A6
Ligand
BDBM50158923
Substrate
Meas. Tech.
ChEMBL_302709 (CHEMBL839581)
Ki
240±n/a nM
Citation
 Denton, TTZhang, XCashman, JR 5-substituted, 6-substituted, and unsubstituted 3-heteroaromatic pyridine analogues of nicotine as selective inhibitors of cytochrome P-450 2A6. J Med Chem 48:224-39 (2005)  
Target
Name:
Cytochrome P450 2A6
Synonyms:
1,4-cineole 2-exo-monooxygenase CP2A6_HUMAN CYP2A6 Coumarin 7-hydroxylase Cytochrome P450 IIA3 | Cytochrome P450(I)
Type:
Protein
Mol. Mass.:
56514.34
Organism:
Homo sapiens (Human)
Description:
P11509
Residue:
494
  
Inhibitor
Name:
BDBM50158923
Synonyms:
5-Pyridin-3-yl-thiophene-2-carbaldehyde oxime US8609708, 18
Type:
Small organic molecule
Emp. Form.:
C10H8N2OS
Mol. Mass.:
204.248
SMILES:
O=NCc1ccc(s1)-c1cccnc1
: