Target
Sigma non-opioid intracellular receptor 1
Ligand
BDBM50159013
Substrate
Meas. Tech.
ChEMBL_303199 (CHEMBL829825)
Ki
0.3±n/a nM
Citation
 Costantino, LGandolfi, FSorbi, CFranchini, SPrezzavento, OVittorio, FRonsisvalle, GLeonardi, APoggesi, EBrasili, L Synthesis and structure-activity relationships of 1-aralkyl-4-benzylpiperidine and 1-aralkyl-4-benzylpiperazine derivatives as potent sigma ligands. J Med Chem 48:266-73 (2005)  
Target
Name:
Sigma non-opioid intracellular receptor 1
Synonyms:
Aging-associated gene 8 protein SGMR1_HUMAN SIGMAR1 SR31747-binding protein Sigma 1-type opioid receptor Sigma1R | hSigmaR1
Type:
Enzyme Catalytic Domain
Mol. Mass.:
25124.85
Organism:
Homo sapiens (Human)
Description:
Q99720
Residue:
223
  
Inhibitor
Name:
BDBM50159013
Synonyms:
3-(4-Benzyl-piperazin-1-ylmethyl)-3,4-dihydro-2H-naphthalen-1-one | CHEMBL360351
Type:
Small organic molecule
Emp. Form.:
C22H26N2O
Mol. Mass.:
334.4546
SMILES:
O=C1CC(CN2CCN(Cc3ccccc3)CC2)Cc2ccccc12
: