Target
Sigma non-opioid intracellular receptor 1
Ligand
BDBM50159016
Substrate
Meas. Tech.
ChEMBL_303199 (CHEMBL829825)
Ki
9.4±n/a nM
Citation
 Costantino, LGandolfi, FSorbi, CFranchini, SPrezzavento, OVittorio, FRonsisvalle, GLeonardi, APoggesi, EBrasili, L Synthesis and structure-activity relationships of 1-aralkyl-4-benzylpiperidine and 1-aralkyl-4-benzylpiperazine derivatives as potent sigma ligands. J Med Chem 48:266-73 (2005)  
Target
Name:
Sigma non-opioid intracellular receptor 1
Synonyms:
Aging-associated gene 8 protein SGMR1_HUMAN SIGMAR1 SR31747-binding protein Sigma 1-type opioid receptor Sigma1R | hSigmaR1
Type:
Enzyme Catalytic Domain
Mol. Mass.:
25124.85
Organism:
Homo sapiens (Human)
Description:
Q99720
Residue:
223
  
Inhibitor
Name:
BDBM50159016
Synonyms:
4-Benzyl-1-(7-methoxy-1,2,3,4-tetrahydro-naphthalen-2-ylmethyl)-piperidine | CHEMBL178680
Type:
Small organic molecule
Emp. Form.:
C24H31NO
Mol. Mass.:
349.509
SMILES:
COc1ccc2CCC(CN3CCC(Cc4ccccc4)CC3)Cc2c1
: