Target
Equilibrative nucleoside transporter 1
Ligand
BDBM50240561
Substrate
Meas. Tech.
ChEMBL_303651 (CHEMBL828999)
Ki
53±n/a nM
Citation
 Tromp, RASpanjersberg, RFvon Frijtag Drabbe Künzel, JKIJzerman, AP Inhibition of nucleoside transport proteins by C8-alkylamine-substituted purines. J Med Chem 48:321-9 (2005)  
Target
Name:
Equilibrative nucleoside transporter 1
Synonyms:
ENT1 Equilibrative Nucleoside Transporter 1 (ENT1) Equilibrative nucleoside transporter 1 S29A1_HUMAN Solute carrier family 29 member 1
Type:
Multi-pass membrane protein
Mol. Mass.:
50225.92
Organism:
Homo sapiens (Human)
Description:
Residue:
456
  
Inhibitor
Name:
BDBM50240561
Synonyms:
(2R,3R,4S,5R)-2-(6-(benzylthio)-9H-purin-9-yl)-5-(hydroxymethyl)-tetrahydrofuran-3,4-diol (2R,3R,4S,5R)-2-(6-Benzylsulfanyl-purin-9-yl)-5-hydroxymethyl-tetrahydro-furan-3,4-diol CHEMBL60662
Type:
Small organic molecule
Emp. Form.:
C17H18N4O4S
Mol. Mass.:
374.414
SMILES:
OC[C@H]1O[C@H]([C@H](O)[C@@H]1O)n1cnc2c(SCc3ccccc3)ncnc12
: