Target
Histamine H3 receptor
Ligand
BDBM50158605
Substrate
Meas. Tech.
ChEMBL_303656 (CHEMBL829004)
Ki
0.52±n/a nM
Citation
 Cowart, MFaghih, RCurtis, MPGfesser, GABennani, YLBlack, LAPan, LMarsh, KCSullivan, JPEsbenshade, TAFox, GBHancock, AA 4-(2-[2-(2(R)-methylpyrrolidin-1-yl)ethyl]benzofuran-5-yl)benzonitrile and related 2-aminoethylbenzofuran H3 receptor antagonists potently enhance cognition and attention. J Med Chem 48:38-55 (2005)  
Target
Name:
Histamine H3 receptor
Synonyms:
HH3R Hrh3
Type:
G Protein-Coupled Receptor (GPCR)
Mol. Mass.:
48607.98
Organism:
Rattus norvegicus (rat)
Description:
Residue:
445
  
Inhibitor
Name:
BDBM50158605
Synonyms:
CHEMBL362662 | {2-[2-((R)-2-Methyl-pyrrolidin-1-yl)-ethyl]-benzofuran-5-yl}-phenyl-methanone
Type:
Small organic molecule
Emp. Form.:
C22H23NO2
Mol. Mass.:
333.4235
SMILES:
C[C@@H]1CCCN1CCc1cc2cc(ccc2o1)C(=O)c1ccccc1
: