Target
Transporter
Ligand
BDBM50046732
Substrate
Meas. Tech.
ChEMBL_303548 (CHEMBL839753)
Ki
3.1±n/a nM
Citation
 Carroll, FITyagi, SBlough, BEKuhar, MJNavarro, HA Synthesis and monoamine transporter binding properties of 3alpha-(substituted phenyl)nortropane-2beta-carboxylic acid methyl esters. Norepinephrine transporter selective compounds. J Med Chem 48:3852-7 (2005)  
Target
Name:
Transporter
Synonyms:
Monoamine transporters; Norepininephrine & dopamine | Norepinephrine Monoamine transporters
Type:
PROTEIN
Mol. Mass.:
66787.87
Organism:
Rattus norvegicus
Description:
ChEMBL_1463061
Residue:
597
  
Inhibitor
Name:
BDBM50046732
Synonyms:
(R)-3-(4-Chloro-phenyl)-8-aza-bicyclo[3.2.1]octane-2-carboxylic acid methyl ester 3-(4-Fluoro-phenyl)-8-methyl-8-aza-bicyclo[3.2.1]octane-2-carboxylic acid methyl ester | CHEMBL81525
Type:
Small organic molecule
Emp. Form.:
C15H18ClNO2
Mol. Mass.:
279.762
SMILES:
COC(=O)C1C2CCC(CC1c1ccc(Cl)cc1)N2
: