Target
Sodium-dependent serotonin transporter
Ligand
BDBM50046737
Substrate
Meas. Tech.
ChEMBL_303285 (CHEMBL828278)
Ki
6.24±n/a nM
Citation
 Carroll, FITyagi, SBlough, BEKuhar, MJNavarro, HA Synthesis and monoamine transporter binding properties of 3alpha-(substituted phenyl)nortropane-2beta-carboxylic acid methyl esters. Norepinephrine transporter selective compounds. J Med Chem 48:3852-7 (2005)  
Target
Name:
Sodium-dependent serotonin transporter
Synonyms:
5-HT Transporter 5HT transporter Anandamid membrane transporter, AMT Monoamine transporters; Norepinephrine & serotonin Slc6a4 Sodium-dependent serotonin transporter (SERT) | imipramine receptor
Type:
Multi-pass membrane protein
Mol. Mass.:
70168.43
Organism:
Rattus norvegicus (rat)
Description:
P31652
Residue:
630
  
Inhibitor
Name:
BDBM50046737
Synonyms:
3-(4-Fluoro-phenyl)-8-aza-bicyclo[3.2.1]octane-2-carboxylic acid methyl ester CHEMBL80515
Type:
Small organic molecule
Emp. Form.:
C15H18FNO2
Mol. Mass.:
263.3073
SMILES:
COC(=O)C1C2CCC(CC1c1ccc(F)cc1)N2
: