Target
Transporter
Ligand
BDBM50168047
Substrate
Meas. Tech.
ChEMBL_303548 (CHEMBL839753)
Ki
2.6±n/a nM
Citation
 Carroll, FITyagi, SBlough, BEKuhar, MJNavarro, HA Synthesis and monoamine transporter binding properties of 3alpha-(substituted phenyl)nortropane-2beta-carboxylic acid methyl esters. Norepinephrine transporter selective compounds. J Med Chem 48:3852-7 (2005)  
Target
Name:
Transporter
Synonyms:
Monoamine transporters; Norepininephrine & dopamine | Norepinephrine Monoamine transporters
Type:
PROTEIN
Mol. Mass.:
66787.87
Organism:
Rattus norvegicus
Description:
ChEMBL_1463061
Residue:
597
  
Inhibitor
Name:
BDBM50168047
Synonyms:
3-(3,4-Difluoro-phenyl)-8-aza-bicyclo[3.2.1]octane-2-carboxylic acid methyl ester | CHEMBL366159
Type:
Small organic molecule
Emp. Form.:
C15H17F2NO2
Mol. Mass.:
281.2978
SMILES:
COC(=O)C1C2CCC(CC1c1ccc(F)c(F)c1)N2
: