Target
Transporter
Ligand
BDBM50046737
Substrate
Meas. Tech.
ChEMBL_303548 (CHEMBL839753)
Ki
11.3±n/a nM
Citation
 Carroll, FITyagi, SBlough, BEKuhar, MJNavarro, HA Synthesis and monoamine transporter binding properties of 3alpha-(substituted phenyl)nortropane-2beta-carboxylic acid methyl esters. Norepinephrine transporter selective compounds. J Med Chem 48:3852-7 (2005)  
Target
Name:
Transporter
Synonyms:
Monoamine transporters; Norepininephrine & dopamine | Norepinephrine Monoamine transporters
Type:
PROTEIN
Mol. Mass.:
66787.87
Organism:
Rattus norvegicus
Description:
ChEMBL_1463061
Residue:
597
  
Inhibitor
Name:
BDBM50046737
Synonyms:
3-(4-Fluoro-phenyl)-8-aza-bicyclo[3.2.1]octane-2-carboxylic acid methyl ester CHEMBL80515
Type:
Small organic molecule
Emp. Form.:
C15H18FNO2
Mol. Mass.:
263.3073
SMILES:
COC(=O)C1C2CCC(CC1c1ccc(F)cc1)N2
: