Target
Solute carrier family 15 member 1
Ligand
BDBM50169145
Substrate
Meas. Tech.
ChEMBL_302952 (CHEMBL841787)
Ki
60000±n/a nM
Citation
 Biegel, AGebauer, SHartrodt, BBrandsch, MNeubert, KThondorf, I Three-dimensional quantitative structure-activity relationship analyses of beta-lactam antibiotics and tripeptides as substrates of the mammalian H+/peptide cotransporter PEPT1. J Med Chem 48:4410-9 (2005)  
Target
Name:
Solute carrier family 15 member 1
Synonyms:
Intestinal H(+)/peptide cotransporter Oligopeptide transporter, small intestine isoform Peptide transporter 1 SLC15A1
Type:
PROTEIN
Mol. Mass.:
78818.07
Organism:
Homo sapiens (Human)
Description:
ChEMBL_1488839
Residue:
708
  
Inhibitor
Name:
BDBM50169145
Synonyms:
1-((S)-2-Amino-propionyl)-piperidine-2-carboxylic acid | CHEMBL366189
Type:
Small organic molecule
Emp. Form.:
C9H16N2O3
Mol. Mass.:
200.2349
SMILES:
C[C@H](N)C(=O)N1CCCCC1C(O)=O
: