Target
Neuronal acetylcholine receptor subunit alpha-7
Ligand
BDBM50061567
Substrate
Meas. Tech.
ChEMBL_304305 (CHEMBL830100)
EC50
31000±n/a nM
Citation
 Jensen, AAFrølund, BLiljefors, TKrogsgaard-Larsen, P Neuronal nicotinic acetylcholine receptors: structural revelations, target identifications, and therapeutic inspirations. J Med Chem 48:4705-45 (2005)  
Target
Name:
Neuronal acetylcholine receptor subunit alpha-7
Synonyms:
ACHA7_HUMAN Cholinergic, Nicotinic Alpha7 Neuronal acetylcholine receptor protein alpha-7 subunit Nicotinic acetylcholine receptor alpha-7 (alpha7 nAChR)
Type:
Mol. Mass.:
56448.33
Organism:
Homo sapiens (Human)
Description:
CHRNA7 (NACHRA7)
Residue:
502
  
Inhibitor
Name:
BDBM50061567
Synonyms:
1,1-Dimethyl-4-phenyl-piperazin-1-ium CHEMBL47814 cid_5911
Type:
Small organic molecule
Emp. Form.:
C12H19N2
Mol. Mass.:
191.2921
SMILES:
C[N+]1(C)CCN(CC1)c1ccccc1
: