Target
Sigma non-opioid intracellular receptor 1
Ligand
BDBM50170651
Substrate
Meas. Tech.
ChEMBL_303441 (CHEMBL839610)
Ki
1±n/a nM
Citation
 Laggner, CSchieferer, CFiechtner, BPoles, GHoffmann, RDGlossmann, HLanger, TMoebius, FF Discovery of high-affinity ligands of sigma1 receptor, ERG2, and emopamil binding protein by pharmacophore modeling and virtual screening. J Med Chem 48:4754-64 (2005)  
Target
Name:
Sigma non-opioid intracellular receptor 1
Synonyms:
Aging-associated gene 8 protein SGMR1_HUMAN SIGMAR1 SR31747-binding protein Sigma 1-type opioid receptor Sigma1R | hSigmaR1
Type:
Enzyme Catalytic Domain
Mol. Mass.:
25124.85
Organism:
Homo sapiens (Human)
Description:
Q99720
Residue:
223
  
Inhibitor
Name:
BDBM50170651
Synonyms:
(3S,8R,9S,10R,13S,14S)-3-(2-Diethylamino-ethoxy)-10,13-dimethyl-1,2,3,4,7,8,9,10,11,12,13,14,15,16-tetradecahydro-cyclopenta[a]phenanthren-17-one | CHEMBL365141
Type:
Small organic molecule
Emp. Form.:
C25H41NO2
Mol. Mass.:
387.5985
SMILES:
CCN(CC)CCO[C@H]1CC[C@]2(C)[C@H]3CC[C@@]4(C)[C@@H](CCC4=O)[C@@H]3CC=C2C1
: