Target
3-beta-hydroxysteroid-Delta(8),Delta(7)-isomerase
Ligand
BDBM50170654
Substrate
Meas. Tech.
ChEMBL_303691 (CHEMBL829736)
Ki
30±n/a nM
Citation
 Laggner, CSchieferer, CFiechtner, BPoles, GHoffmann, RDGlossmann, HLanger, TMoebius, FF Discovery of high-affinity ligands of sigma1 receptor, ERG2, and emopamil binding protein by pharmacophore modeling and virtual screening. J Med Chem 48:4754-64 (2005)  
Target
Name:
3-beta-hydroxysteroid-Delta(8),Delta(7)-isomerase
Synonyms:
3-beta-hydroxysteroid-Delta(8),Delta(7)-isomerase/Delta(24)-sterol reductase Anti-estrogen binding site (AEBS) D8-D7 sterol isomerase EBP Emopamil-binding protein
Type:
PROTEIN
Mol. Mass.:
26358.51
Organism:
Homo sapiens (Human)
Description:
ChEMBL_873432
Residue:
230
  
Inhibitor
Name:
BDBM50170654
Synonyms:
(+-)-cis-4-(3-(4-tert-butylphenyl)-2-methylpropyl)-2,6-dimethylmorpholine CHEMBL372700 cis-4-(3-(4-(1,1-dimethylethyl)phenyl)-2-methylpropyl)-2,6-dimethylmorpholine cis-fenpropimorph fenpropimorph cis-form | fenpropimorphe
Type:
Small organic molecule
Emp. Form.:
C20H33NO
Mol. Mass.:
303.4821
SMILES:
CC(CN1C[C@H](C)O[C@H](C)C1)Cc1ccc(cc1)C(C)(C)C
: