Target
C-8 sterol isomerase ERG2
Ligand
BDBM50170654
Substrate
Meas. Tech.
ChEMBL_303390 (CHEMBL839961)
Ki
0.05±n/a nM
Citation
 Laggner, CSchieferer, CFiechtner, BPoles, GHoffmann, RDGlossmann, HLanger, TMoebius, FF Discovery of high-affinity ligands of sigma1 receptor, ERG2, and emopamil binding protein by pharmacophore modeling and virtual screening. J Med Chem 48:4754-64 (2005)  
Target
Name:
C-8 sterol isomerase ERG2
Synonyms:
C-8 sterol isomerase ERG2 | ERG2_YEAST
Type:
PROTEIN
Mol. Mass.:
24892.29
Organism:
Saccharomyces cerevisiae
Description:
ChEMBL_303390
Residue:
222
  
Inhibitor
Name:
BDBM50170654
Synonyms:
(+-)-cis-4-(3-(4-tert-butylphenyl)-2-methylpropyl)-2,6-dimethylmorpholine CHEMBL372700 cis-4-(3-(4-(1,1-dimethylethyl)phenyl)-2-methylpropyl)-2,6-dimethylmorpholine cis-fenpropimorph fenpropimorph cis-form | fenpropimorphe
Type:
Small organic molecule
Emp. Form.:
C20H33NO
Mol. Mass.:
303.4821
SMILES:
CC(CN1C[C@H](C)O[C@H](C)C1)Cc1ccc(cc1)C(C)(C)C
: