Target
Tissue alpha-L-fucosidase
Ligand
BDBM50065258
Substrate
Meas. Tech.
ChEBML_305486
Ki
1.7±n/a nM
Citation
 Kato, AKato, NKano, EAdachi, IIkeda, KYu, LOkamoto, TBanba, YOuchi, HTakahata, HAsano, N Biological properties of D- and L-1-deoxyazasugars. J Med Chem 48:2036-44 (2005)  
Target
Name:
Tissue alpha-L-fucosidase
Synonyms:
Alpha-L-fucosidase 1 FUCO_BOVIN
Type:
PROTEIN
Mol. Mass.:
54093.12
Organism:
Bos taurus
Description:
ChEMBL_335897
Residue:
468
  
Inhibitor
Name:
BDBM50065258
Synonyms:
(2S,3R,4S,5R)-2-Methyl-piperidine-3,4,5-triol CHEMBL314772 | Fucosidase Inhibitor, 3
Type:
Small organic molecule
Emp. Form.:
C6H13NO3
Mol. Mass.:
147.1723
SMILES:
C[C@@H]1NC[C@@H](O)[C@H](O)[C@@H]1O
: