Target
D(4) dopamine receptor
Ligand
BDBM50164595
Substrate
Meas. Tech.
ChEMBL_303438 (CHEMBL839607)
Ki
550±n/a nM
Citation
 Di Stefano, ASozio, PCacciatore, ICocco, AGiorgioni, GCosta, BMontali, MLucacchini, AMartini, CSpoto, GDi Pietrantonio, FDi Matteo, EPinnen, F Preparation and pharmacological characterization of trans-2-amino-5(6)-fluoro-6(5)-hydroxy-1-phenyl-2,3-dihydro-1H-indenes as D2-like dopamine receptor agonists. J Med Chem 48:2646-54 (2005)  
Target
Name:
D(4) dopamine receptor
Synonyms:
D(2C) dopamine receptor DOPAMINE D4.2 DRD4 Dopamine D4 receptor
Type:
Enzyme
Mol. Mass.:
48373.19
Organism:
Homo sapiens (Human)
Description:
P21917
Residue:
419
  
Inhibitor
Name:
BDBM50164595
Synonyms:
((1R,2R)-6-Fluoro-5-methoxy-1-phenyl-indan-2-yl)-dipropyl-amine; hydrochloride | CHEMBL536044
Type:
Small organic molecule
Emp. Form.:
C22H28FNO
Mol. Mass.:
341.4622
SMILES:
CCCN(CCC)[C@@H]1Cc2cc(OC)c(F)cc2[C@H]1c1ccccc1
: