Target
Mu-type opioid receptor
Ligand
BDBM50001707
Substrate
Meas. Tech.
ChEMBL_303276 (CHEMBL828270)
Ki
0.97±n/a nM
Citation
 Lattanzi, RSpetea, MSchüllner, FRief, SBKrassnig, RNegri, LSchmidhammer, H Synthesis and biological evaluation of 14-alkoxymorphinans. 22.(1) Influence of the 14-alkoxy group and the substitution in position 5 in 14-alkoxymorphinan-6-ones on in vitro and in vivo activities. J Med Chem 48:3372-8 (2005)  
Target
Name:
Mu-type opioid receptor
Synonyms:
MOR-1 Mu-type opioid receptor (MOR) OPRM_RAT Opioid receptor B Ror-b
Type:
G Protein-Coupled Receptor (GPCR)
Mol. Mass.:
44503.11
Organism:
Rattus norvegicus (rat)
Description:
Competition binding assays were carried out using membrane preparations from transfected HN9.10 cells that constitutively expressed the mu opioid receptor.
Residue:
398
  
Inhibitor
Name:
BDBM50001707
Synonyms:
10,17-dihydroxy-4-methyl-(13R,17S)-12-oxa-4-azapentacyclo[9.6.1.01,13.05,17.07,18]octadeca-7(18),8,10-trien-14-one 10,17-dihydroxy-4-methyl-(13R,17S)-12-oxa-4-azapentacyclo[9.6.1.01,13.05,17.07,18]octadeca-7(18),8,10-trien-14-one(xymorphone) CHEMBL963 Combunox OXYMORPHONE Oxycet Percocet Roxicet Roxiprin Tylox-325
Type:
Small organic molecule
Emp. Form.:
C17H19NO4
Mol. Mass.:
301.3371
SMILES:
CN1CC[C@@]23[C@H]4Oc5c2c(C[C@@H]1[C@]3(O)CCC4=O)ccc5O
: