Target
Mandelate racemase
Ligand
BDBM50170970
Substrate
Meas. Tech.
ChEMBL_320802 (CHEMBL884757)
pH
8.7±n/a
Ki
6930000±n/a nM
Comments
extracted
Citation
 Burley, RKBearne, SL Inhibition of mandelate racemase by the substrate-intermediate-product analogue 1,1-diphenyl-1-hydroxymethylphosphonate. Bioorg Med Chem Lett 15:4342-4 (2005)  
Target
Name:
Mandelate racemase
Synonyms:
MANR_PSEPU Mandelate racemase (MR) | mdlA
Type:
Protein
Mol. Mass.:
38561.77
Organism:
Pseudomonas putida (g-Proteobacteria)
Description:
Residue:
359
  
Inhibitor
Name:
BDBM50170970
Synonyms:
1,1-diphenyl-1-hydroxymethylphosphonate
Type:
Small organic molecule
Emp. Form.:
C13H11O4P
Mol. Mass.:
262.1989
SMILES:
OC(c1ccccc1)(c1ccccc1)P([O-])([O-])=O
: