Target
Sodium-dependent serotonin transporter
Ligand
BDBM50173715
Substrate
Meas. Tech.
ChEMBL_320823 (CHEMBL872358)
Ki
0.18±n/a nM
Citation
 Mattson, RJCatt, JDDenhart, DJDeskus, JADitta, JLHiggins, MAMarcin, LRSloan, CPBeno, BRGao, QCunningham, MAMattson, GKMolski, TFTaber, MTLodge, NJ Conformationally restricted homotryptamines. 2. Indole cyclopropylmethylamines as selective serotonin reuptake inhibitors. J Med Chem 48:6023-34 (2005)  
Target
Name:
Sodium-dependent serotonin transporter
Synonyms:
5-HT Transporter 5HTT SC6A4_HUMAN SLC6A4 Serotonin transporter (5HTT) Sodium-dependent serotonin transporter (SERT) | Solute carrier family 6 member 4
Type:
Multi-pass membrane protein
Mol. Mass.:
70322.51
Organism:
Homo sapiens (Human)
Description:
P31645
Residue:
630
  
Inhibitor
Name:
BDBM50173715
Synonyms:
(+)3-((1S,2S)-2-Dimethylaminomethyl-cyclopropyl)-1H-indole-5-carbonitrile 3-((1S,2S)-2-Dimethylaminomethyl-cyclopropyl)-1H-indole-5-carbonitrile | CHEMBL196468
Type:
Small organic molecule
Emp. Form.:
C15H17N3
Mol. Mass.:
239.3156
SMILES:
CN(C)C[C@H]1C[C@@H]1c1c[nH]c2ccc(cc12)C#N
: