Target
5-hydroxytryptamine receptor 1B
Ligand
BDBM50145347
Substrate
Meas. Tech.
ChEMBL_320743 (CHEMBL881216)
Ki
281±n/a nM
Citation
 Morphy, RRankovic, Z Designed multiple ligands. An emerging drug discovery paradigm. J Med Chem 48:6523-43 (2005)  
Target
Name:
5-hydroxytryptamine receptor 1B
Synonyms:
5-HT-1B 5-HT1B 5HT1B_HUMAN HTR1DB Serotonin (5-HT) receptor Serotonin Receptor 1B
Type:
G Protein-Coupled Receptor (GPCR)
Mol. Mass.:
43579.17
Organism:
Homo sapiens (Human)
Description:
Receptor binding assays were performed using human clone stably expressed in CHO cells
Residue:
390
  
Inhibitor
Name:
BDBM50145347
Synonyms:
1-(2-(4-(6-fluoro-1H-indol-3-yl)-5,6-dihydropyridin-1(2H)-yl)ethyl)-3,4-dihydro-1H-isochromene-6-carboxamide CHEMBL83617
Type:
Small organic molecule
Emp. Form.:
C25H26FN3O2
Mol. Mass.:
419.4912
SMILES:
NC(=O)c1ccc2C(CCN3CCC(=CC3)c3c[nH]c4cc(F)ccc34)OCCc2c1
: