Target
Endothelin-1 receptor
Ligand
BDBM50175523
Substrate
Meas. Tech.
ChEMBL_320764 (CHEMBL884719)
Ki
9.3±n/a nM
Citation
 Morphy, RRankovic, Z Designed multiple ligands. An emerging drug discovery paradigm. J Med Chem 48:6523-43 (2005)  
Target
Name:
Endothelin-1 receptor
Synonyms:
EDNRA ET-A ETA-R Endothelin receptor type A hET-AR
Type:
Enzyme Catalytic Domain
Mol. Mass.:
48736.88
Organism:
Homo sapiens (Human)
Description:
P25101
Residue:
427
  
Inhibitor
Name:
BDBM50175523
Synonyms:
4''-(2-Butyl-4-oxo-1,3-diaza-spiro[4.4]non-1-en-3-ylmethyl)-2''-ethoxymethyl-biphenyl-2-sulfonic acid (4,5-dimethyl-isoxazol-3-yl)-amide CHEMBL539423
Type:
Small organic molecule
Emp. Form.:
C32H40N4O5S
Mol. Mass.:
592.749
SMILES:
CCCCC1=NC2(CCCC2)C(=O)N1Cc1ccc(c(COCC)c1)-c1ccccc1S(=O)(=O)Nc1noc(C)c1C
: