Target
Type-1 angiotensin II receptor B
Ligand
BDBM50175587
Substrate
Meas. Tech.
ChEMBL_321028 (CHEMBL883660)
pH
7.4±n/a
Ki
>10000±n/a nM
Comments
extracted
Citation
 Georgsson, JSköld, CPlouffe, BLindeberg, GBotros, MLarhed, MNyberg, FGallo-Payet, NGogoll, AKarlén, AHallberg, A Angiotensin II pseudopeptides containing 1,3,5-trisubstituted benzene scaffolds with high AT2 receptor affinity. J Med Chem 48:6620-31 (2005)  
Target
Name:
Type-1 angiotensin II receptor B
Synonyms:
AGTRB_RAT Agtr1 Angiotensin II AT1B Angiotensin II type 1b (AT-1b) receptor Type-1B angiotensin II receptor
Type:
Enzyme Catalytic Domain
Mol. Mass.:
40929.44
Organism:
RAT
Description:
Angiotensin II AT1B 0 RAT::P29089
Residue:
359
  
Inhibitor
Name:
BDBM50175587
Synonyms:
(S)-3-Amino-N-{(S)-1-[3-[(S)-2-[2-((S)-(S)-1-carboxy-2-phenyl-ethylcarbamoyl)-pyrrolidin-1-yl]-1-(3H-imidazol-4-ylmethyl)-2-oxo-ethylcarbamoyl]-5-(4-hydroxy-benzyl)-phenylcarbamoyl]-4-guanidino-butyl}-succinamic acid | CHEMBL194864
Type:
Small organic molecule
Emp. Form.:
C44H53N11O10
Mol. Mass.:
895.9593
SMILES:
N[C@@H](CC(O)=O)C(=O)N[C@@H](CCCNC(N)=N)C(=O)Nc1cc(Cc2ccc(O)cc2)cc(c1)C(=O)N[C@@H](Cc1cnc[nH]1)C(=O)N1CCC[C@H]1C(=O)N[C@@H](Cc1ccccc1)C(O)=O
: