Target
Adenosine receptor A3
Ligand
BDBM50176055
Substrate
Meas. Tech.
ChEMBL_320990 (CHEMBL872137)
Ki
760±n/a nM
Citation
 Minetti, PTinti, MOCarminati, PCastorina, MDi Cesare, MADi Serio, SGallo, GGhirardi, OGiorgi, FGiorgi, LPiersanti, GBartoccini, FTarzia, G 2-n-Butyl-9-methyl-8-[1,2,3]triazol-2-yl-9H-purin-6-ylamine and analogues as A2A adenosine receptor antagonists. Design, synthesis, and pharmacological characterization. J Med Chem 48:6887-96 (2005)  
Target
Name:
Adenosine receptor A3
Synonyms:
A3 adenosine receptor (hA3) ADORA3 | Adenosine A3 receptor (A3AR)
Type:
G Protein-Coupled Receptor (GPCR)
Mol. Mass.:
36197.32
Organism:
Homo sapiens (Human)
Description:
P0DMS8
Residue:
318
  
Inhibitor
Name:
BDBM50176055
Synonyms:
9-Methyl-2-pentyl-8-[1,2,3]triazol-2-yl-9H-purin-6-ylamine | CHEMBL196258
Type:
Small organic molecule
Emp. Form.:
C13H18N8
Mol. Mass.:
286.3356
SMILES:
CCCCCc1nc(N)c2nc(-n3nccn3)n(C)c2n1
: