Target
Adenosine receptor A3
Ligand
BDBM21218
Substrate
Meas. Tech.
ChEMBL_325562 (CHEMBL860281)
Ki
130±n/a nM
Citation
 Novellino, ECosimelli, BEhlardo, MGreco, GIadanza, MLavecchia, ARimoli, MGSala, ADa Settimo, APrimofiore, GDa Settimo, FTaliani, SLa Motta, CKlotz, KNTuscano, DTrincavelli, MLMartini, C 2-(Benzimidazol-2-yl)quinoxalines: a novel class of selective antagonists at human A(1) and A(3) adenosine receptors designed by 3D database searching. J Med Chem 48:8253-60 (2005)  
Target
Name:
Adenosine receptor A3
Synonyms:
A3 adenosine receptor (hA3) ADORA3 | Adenosine A3 receptor (A3AR)
Type:
G Protein-Coupled Receptor (GPCR)
Mol. Mass.:
36197.32
Organism:
Homo sapiens (Human)
Description:
P0DMS8
Residue:
318
  
Inhibitor
Name:
BDBM21218
Synonyms:
2,5,8-trimethyl-4,7-dihydro-1H-benzo[1,2-d:3,4-d :5,6-d ]triimidazole CHEMBL200480 | benzotriimidazole, D
Type:
Small organic molecule
Emp. Form.:
C12H12N6
Mol. Mass.:
240.2639
SMILES:
Cc1nc2c([nH]1)c1nc(C)[nH]c1c1nc(C)[nH]c21
: