Target
Adenosine receptor A1
Ligand
BDBM21213
Substrate
Meas. Tech.
ChEMBL_325560 (CHEMBL860279)
Ki
>10000±n/a nM
Citation
 Novellino, ECosimelli, BEhlardo, MGreco, GIadanza, MLavecchia, ARimoli, MGSala, ADa Settimo, APrimofiore, GDa Settimo, FTaliani, SLa Motta, CKlotz, KNTuscano, DTrincavelli, MLMartini, C 2-(Benzimidazol-2-yl)quinoxalines: a novel class of selective antagonists at human A(1) and A(3) adenosine receptors designed by 3D database searching. J Med Chem 48:8253-60 (2005)  
Target
Name:
Adenosine receptor A1
Synonyms:
A1 adenosine receptor (hA1) AA1R_HUMAN ADORA1 Adenosine A1-receptor Adenosine receptor A1 (hA1) | Adenosine transporter (AdT)
Type:
G Protein-Coupled Receptor (GPCR)
Mol. Mass.:
36520.92
Organism:
Homo sapiens (Human)
Description:
P30542
Residue:
326
  
Inhibitor
Name:
BDBM21213
Synonyms:
2,2 -(4H-1,2,4-triazole-3,5-diyl)dipyridine 2-[5-(pyridin-2-yl)-4H-1,2,4-triazol-3-yl]pyridine triazole-dipyridine, A
Type:
Small organic molecule
Emp. Form.:
C12H9N5
Mol. Mass.:
223.2334
SMILES:
c1ccc(nc1)-c1nnc([nH]1)-c1ccccn1
: