Target
Adenosine receptor A3
Ligand
BDBM50179301
Substrate
Meas. Tech.
ChEMBL_325562 (CHEMBL860281)
Ki
104.2±n/a nM
Citation
 Novellino, ECosimelli, BEhlardo, MGreco, GIadanza, MLavecchia, ARimoli, MGSala, ADa Settimo, APrimofiore, GDa Settimo, FTaliani, SLa Motta, CKlotz, KNTuscano, DTrincavelli, MLMartini, C 2-(Benzimidazol-2-yl)quinoxalines: a novel class of selective antagonists at human A(1) and A(3) adenosine receptors designed by 3D database searching. J Med Chem 48:8253-60 (2005)  
Target
Name:
Adenosine receptor A3
Synonyms:
A3 adenosine receptor (hA3) ADORA3 | Adenosine A3 receptor (A3AR)
Type:
G Protein-Coupled Receptor (GPCR)
Mol. Mass.:
36197.32
Organism:
Homo sapiens (Human)
Description:
P0DMS8
Residue:
318
  
Inhibitor
Name:
BDBM50179301
Synonyms:
2,5,8-triethyl-4,7-dihydro-1H-benzo[1,2-d:3,4-d':5,6-d'']-triimidazole | CHEMBL198461
Type:
Small organic molecule
Emp. Form.:
C15H18N6
Mol. Mass.:
282.3436
SMILES:
CCc1nc2c([nH]1)c1nc(CC)[nH]c1c1nc(CC)[nH]c21
: