Target
Adenosine receptor A3
Ligand
BDBM50179300
Substrate
Meas. Tech.
ChEMBL_325562 (CHEMBL860281)
Ki
437±n/a nM
Citation
 Novellino, ECosimelli, BEhlardo, MGreco, GIadanza, MLavecchia, ARimoli, MGSala, ADa Settimo, APrimofiore, GDa Settimo, FTaliani, SLa Motta, CKlotz, KNTuscano, DTrincavelli, MLMartini, C 2-(Benzimidazol-2-yl)quinoxalines: a novel class of selective antagonists at human A(1) and A(3) adenosine receptors designed by 3D database searching. J Med Chem 48:8253-60 (2005)  
Target
Name:
Adenosine receptor A3
Synonyms:
A3 adenosine receptor (hA3) ADORA3 | Adenosine A3 receptor (A3AR)
Type:
G Protein-Coupled Receptor (GPCR)
Mol. Mass.:
36197.32
Organism:
Homo sapiens (Human)
Description:
P0DMS8
Residue:
318
  
Inhibitor
Name:
BDBM50179300
Synonyms:
7,8-Dihydro-3H,6H-5-thia-1,2,3,4,8a-pentaaza-cyclopenta[b]naphthalen-9-one | CHEMBL197427
Type:
Small organic molecule
Emp. Form.:
C7H7N5OS
Mol. Mass.:
209.228
SMILES:
O=c1n2CCCSc2nc2nn[nH]c12
: