Target
Adenosine receptor A2a
Ligand
BDBM50179293
Substrate
Meas. Tech.
ChEMBL_325561 (CHEMBL860280)
Ki
>10000±n/a nM
Citation
 Novellino, ECosimelli, BEhlardo, MGreco, GIadanza, MLavecchia, ARimoli, MGSala, ADa Settimo, APrimofiore, GDa Settimo, FTaliani, SLa Motta, CKlotz, KNTuscano, DTrincavelli, MLMartini, C 2-(Benzimidazol-2-yl)quinoxalines: a novel class of selective antagonists at human A(1) and A(3) adenosine receptors designed by 3D database searching. J Med Chem 48:8253-60 (2005)  
Target
Name:
Adenosine receptor A2a
Synonyms:
A2A adenosine receptor (hA2A) ADENOSINE A2 ADORA2 Adenosine A2A receptor (A2AAR)
Type:
G Protein-Coupled Receptor (GPCR)
Mol. Mass.:
44716.46
Organism:
Homo sapiens (Human)
Description:
P29274
Residue:
412
  
Inhibitor
Name:
BDBM50179293
Synonyms:
2-(4,6-dichloro-1H-benzo[d]imidazol-2-yl)quinoxaline | CHEMBL197743
Type:
Small organic molecule
Emp. Form.:
C15H8Cl2N4
Mol. Mass.:
315.157
SMILES:
Clc1cc(Cl)c2[nH]c(nc2c1)-c1cnc2ccccc2n1
: