Target
Adenosine receptor A2a
Ligand
BDBM50179289
Substrate
Meas. Tech.
ChEMBL_325561 (CHEMBL860280)
Ki
>10000±n/a nM
Citation
 Novellino, ECosimelli, BEhlardo, MGreco, GIadanza, MLavecchia, ARimoli, MGSala, ADa Settimo, APrimofiore, GDa Settimo, FTaliani, SLa Motta, CKlotz, KNTuscano, DTrincavelli, MLMartini, C 2-(Benzimidazol-2-yl)quinoxalines: a novel class of selective antagonists at human A(1) and A(3) adenosine receptors designed by 3D database searching. J Med Chem 48:8253-60 (2005)  
Target
Name:
Adenosine receptor A2a
Synonyms:
A2A adenosine receptor (hA2A) ADENOSINE A2 ADORA2 Adenosine A2A receptor (A2AAR)
Type:
G Protein-Coupled Receptor (GPCR)
Mol. Mass.:
44716.46
Organism:
Homo sapiens (Human)
Description:
P29274
Residue:
412
  
Inhibitor
Name:
BDBM50179289
Synonyms:
2-ethyl-5,8-dimethyl-4,7-dihydro-1H-benzo[1,2-d:3,4-d':5,6-d'']-triimidazole | CHEMBL198460
Type:
Small organic molecule
Emp. Form.:
C13H14N6
Mol. Mass.:
254.2905
SMILES:
CCc1nc2c3[nH]c(C)nc3c3nc(C)[nH]c3c2[nH]1
: