Target
Adenosine receptor A3
Ligand
BDBM50179305
Substrate
Meas. Tech.
ChEMBL_325562 (CHEMBL860281)
Ki
>1000±n/a nM
Citation
 Novellino, ECosimelli, BEhlardo, MGreco, GIadanza, MLavecchia, ARimoli, MGSala, ADa Settimo, APrimofiore, GDa Settimo, FTaliani, SLa Motta, CKlotz, KNTuscano, DTrincavelli, MLMartini, C 2-(Benzimidazol-2-yl)quinoxalines: a novel class of selective antagonists at human A(1) and A(3) adenosine receptors designed by 3D database searching. J Med Chem 48:8253-60 (2005)  
Target
Name:
Adenosine receptor A3
Synonyms:
A3 adenosine receptor (hA3) ADORA3 | Adenosine A3 receptor (A3AR)
Type:
G Protein-Coupled Receptor (GPCR)
Mol. Mass.:
36197.32
Organism:
Homo sapiens (Human)
Description:
P0DMS8
Residue:
318
  
Inhibitor
Name:
BDBM50179305
Synonyms:
6,7-Dihydro-3H-thiazolo[3,2-a][1,2,3]triazolo[4,5-d]pyrimidin-9-one | CHEMBL198959
Type:
Small organic molecule
Emp. Form.:
C6H5N5OS
Mol. Mass.:
195.202
SMILES:
O=c1n2CCSc2nc2nn[nH]c12
: