Target
Aldo-keto reductase family 1 member C3
Ligand
BDBM50174204
Substrate
Meas. Tech.
ChEMBL_326008 (CHEMBL869399)
IC50
11000±n/a nM
Citation
 Gobec, SBrozic, PRizner, TL Nonsteroidal anti-inflammatory drugs and their analogues as inhibitors of aldo-keto reductase AKR1C3: new lead compounds for the development of anticancer agents. Bioorg Med Chem Lett 15:5170-5 (2005)  
Target
Name:
Aldo-keto reductase family 1 member C3
Synonyms:
17-beta-Hydroxysteroid Dehydrogenase 5 (17-beta-HSD5, AKR1C3) AK1C3_HUMAN Aldo-keto reductase family 1 member C3 Aldo-keto reductase family 1 member C3 (AK1C3a) Aldo-keto-reductase family 1 member C3 Dihydrodiol dehydrogenase 3 Estradiol 17-beta-dehydrogenase KIAA0119 Prostaglandin F synthase Trans-1,2-dihydrobenzene-1,2-diol dehydrogenase
Type:
Enzyme
Mol. Mass.:
36859.86
Organism:
Homo sapiens (Human)
Description:
P42330
Residue:
323
  
Inhibitor
Name:
BDBM50174204
Synonyms:
2-[(2,2-diphenylacetyl)amino]benzoic acid | CHEMBL196755
Type:
Small organic molecule
Emp. Form.:
C21H17NO3
Mol. Mass.:
331.3646
SMILES:
OC(=O)c1ccccc1NC(=O)C(c1ccccc1)c1ccccc1
: