Target
Glutamate receptor ionotropic, kainate 1
Ligand
BDBM50178136
Substrate
Meas. Tech.
ChEMBL_326521 (CHEMBL862719)
Kd
402±n/a nM
Citation
 Dolman, NPTroop, HMMore, JCAlt, AKnauss, JLNistico, RJack, SMorley, RMBortolotto, ZARoberts, PJBleakman, DCollingridge, GLJane, DE Synthesis and pharmacology of willardiine derivatives acting as antagonists of kainate receptors. J Med Chem 48:7867-81 (2005)  
Target
Name:
Glutamate receptor ionotropic, kainate 1
Synonyms:
GRIK1_RAT Glutamate receptor ionotropic kainate 1 Glutamate receptor, ionotropic kainate 1 Grik1
Type:
Enzyme Catalytic Domain
Mol. Mass.:
107860.82
Organism:
RAT
Description:
P22756
Residue:
949
  
Inhibitor
Name:
BDBM50178136
Synonyms:
(S)-1-(2-amino-2-carboxyethyl)-3-(2-carboxybenzyl)-pyrimidine-2,4-dione (S)-2-((3-(2-amino-2-carboxyethyl)-2,6-dioxo-2,3-dihydropyrimidin-1(6H)-yl)methyl)benzoic acid UBP-302
Type:
Small organic molecule
Emp. Form.:
C15H15N3O6
Mol. Mass.:
333.2961
SMILES:
N[C@@H](Cn1ccc(=O)n(Cc2ccccc2C(O)=O)c1=O)C(O)=O
: