Target
Oxytocin receptor
Ligand
BDBM50178158
Substrate
Meas. Tech.
ChEMBL_326537 (CHEMBL863355)
Ki
500±n/a nM
Citation
 Quattropani, ADorbais, JCovini, DPittet, PAColovray, VThomas, RJCoxhead, RHalazy, SScheer, AMissotten, MAyala, GBradshaw, CDe Raemy-Schenk, AMNichols, ACirillo, RTos, EGGiachetti, CGolzio, LMarinelli, PChurch, DJBarberis, CChollet, ASchwarz, MK Discovery and development of a new class of potent, selective, orally active oxytocin receptor antagonists. J Med Chem 48:7882-905 (2005)  
Target
Name:
Oxytocin receptor
Synonyms:
OT-R OXYR_HUMAN | Oxytocin
Type:
Enzyme Catalytic Domain
Mol. Mass.:
42793.26
Organism:
Homo sapiens (Human)
Description:
Oxytocin OXTR HEK293::B2R9L7
Residue:
389
  
Inhibitor
Name:
BDBM50178158
Synonyms:
2-(2-(2-(4-ethoxy-N-p-tolylphenylsulfonamido)acetyl)-1,2,3,4-tetrahydroisoquinolin-3-yl)acetamide | CHEMBL427190
Type:
Small organic molecule
Emp. Form.:
C28H31N3O5S
Mol. Mass.:
521.628
SMILES:
CCOc1ccc(cc1)S(=O)(=O)N(CC(=O)N1Cc2ccccc2CC1CC(N)=O)c1ccc(C)cc1
: