Target
Vasopressin V1a receptor
Ligand
BDBM50178173
Substrate
Meas. Tech.
ChEMBL_326539 (CHEMBL863357)
Ki
>10000±n/a nM
Citation
 Quattropani, ADorbais, JCovini, DPittet, PAColovray, VThomas, RJCoxhead, RHalazy, SScheer, AMissotten, MAyala, GBradshaw, CDe Raemy-Schenk, AMNichols, ACirillo, RTos, EGGiachetti, CGolzio, LMarinelli, PChurch, DJBarberis, CChollet, ASchwarz, MK Discovery and development of a new class of potent, selective, orally active oxytocin receptor antagonists. J Med Chem 48:7882-905 (2005)  
Target
Name:
Vasopressin V1a receptor
Synonyms:
AVPR V1a AVPR1A V1AR_HUMAN VASOPRESSIN V1A Vasopressin V1 receptor Vasopressin receptor
Type:
Receptor
Mol. Mass.:
46820.18
Organism:
Homo sapiens (Human)
Description:
P37288
Residue:
418
  
Inhibitor
Name:
BDBM50178173
Synonyms:
4-ethoxy-N-(2-{(2E)-2-[1-(1-hydroxy-2-naphthyl)ethylidene]hydrazino}-2-oxoethyl}-N-(4-methylphenyl)benzenesulfonamide | CHEMBL380582
Type:
Small organic molecule
Emp. Form.:
C29H29N3O5S
Mol. Mass.:
531.623
SMILES:
CCOc1ccc(cc1)S(=O)(=O)N(CC(=O)NN=C(C)c1ccc2ccccc2c1O)c1ccc(C)cc1
: