Target
Oxytocin receptor
Ligand
BDBM50178165
Substrate
Meas. Tech.
ChEMBL_326537 (CHEMBL863355)
Ki
>10000±n/a nM
Citation
 Quattropani, ADorbais, JCovini, DPittet, PAColovray, VThomas, RJCoxhead, RHalazy, SScheer, AMissotten, MAyala, GBradshaw, CDe Raemy-Schenk, AMNichols, ACirillo, RTos, EGGiachetti, CGolzio, LMarinelli, PChurch, DJBarberis, CChollet, ASchwarz, MK Discovery and development of a new class of potent, selective, orally active oxytocin receptor antagonists. J Med Chem 48:7882-905 (2005)  
Target
Name:
Oxytocin receptor
Synonyms:
OT-R OXYR_HUMAN | Oxytocin
Type:
Enzyme Catalytic Domain
Mol. Mass.:
42793.26
Organism:
Homo sapiens (Human)
Description:
Oxytocin OXTR HEK293::B2R9L7
Residue:
389
  
Inhibitor
Name:
BDBM50178165
Synonyms:
CHEMBL382071 | N-(2-{2-[4-(diethylamino)-2-hydroxybenzylidene]hydrazino}-2-oxoethyl)-4-ethoxy-N-(4-methylphenyl)benzenesulfonamide
Type:
Small organic molecule
Emp. Form.:
C28H34N4O5S
Mol. Mass.:
538.658
SMILES:
CCOc1ccc(cc1)S(=O)(=O)N(CC(=O)NN=Cc1ccc(cc1O)N(CC)CC)c1ccc(C)cc1
: