Target
Oxytocin receptor
Ligand
BDBM50178214
Substrate
Meas. Tech.
ChEMBL_326537 (CHEMBL863355)
Ki
100±n/a nM
Citation
 Quattropani, ADorbais, JCovini, DPittet, PAColovray, VThomas, RJCoxhead, RHalazy, SScheer, AMissotten, MAyala, GBradshaw, CDe Raemy-Schenk, AMNichols, ACirillo, RTos, EGGiachetti, CGolzio, LMarinelli, PChurch, DJBarberis, CChollet, ASchwarz, MK Discovery and development of a new class of potent, selective, orally active oxytocin receptor antagonists. J Med Chem 48:7882-905 (2005)  
Target
Name:
Oxytocin receptor
Synonyms:
OT-R OXYR_HUMAN | Oxytocin
Type:
Enzyme Catalytic Domain
Mol. Mass.:
42793.26
Organism:
Homo sapiens (Human)
Description:
Oxytocin OXTR HEK293::B2R9L7
Residue:
389
  
Inhibitor
Name:
BDBM50178214
Synonyms:
2-[Benzenesulfonyl-(4-methoxy-phenyl)-amino]-N-(3-chloro-2-methyl-phenyl)-acetamide N-(3-chloro-2-methylphenyl)-2-(N-(4-methoxyphenyl)phenylsulfonamido)acetamide
Type:
Small organic molecule
Emp. Form.:
C22H21ClN2O4S
Mol. Mass.:
444.931
SMILES:
COc1ccc(cc1)N(CC(=O)Nc1cccc(Cl)c1C)S(=O)(=O)c1ccccc1
: