Target
Oxytocin receptor
Ligand
BDBM50410639
Substrate
Meas. Tech.
ChEMBL_326537 (CHEMBL863355)
Ki
111±n/a nM
Citation
 Quattropani, ADorbais, JCovini, DPittet, PAColovray, VThomas, RJCoxhead, RHalazy, SScheer, AMissotten, MAyala, GBradshaw, CDe Raemy-Schenk, AMNichols, ACirillo, RTos, EGGiachetti, CGolzio, LMarinelli, PChurch, DJBarberis, CChollet, ASchwarz, MK Discovery and development of a new class of potent, selective, orally active oxytocin receptor antagonists. J Med Chem 48:7882-905 (2005)  
Target
Name:
Oxytocin receptor
Synonyms:
OT-R OXYR_HUMAN | Oxytocin
Type:
Enzyme Catalytic Domain
Mol. Mass.:
42793.26
Organism:
Homo sapiens (Human)
Description:
Oxytocin OXTR HEK293::B2R9L7
Residue:
389
  
Inhibitor
Name:
BDBM50410639
Synonyms:
CHEMBL2113205
Type:
Small organic molecule
Emp. Form.:
C24H19N5O4S
Mol. Mass.:
473.504
SMILES:
Cc1ccc(cc1)N(CC(=O)NN=C1C(=O)Nc2ccccc12)S(=O)(=O)c1ccc(cc1)C#N
: