Target
cAMP-specific 3',5'-cyclic phosphodiesterase 4B
Ligand
BDBM50174013
Substrate
Meas. Tech.
ChEMBL_326770 (CHEMBL860120)
IC50
0.3±n/a nM
Citation
 Macdonald, DMastracchio, APerrier, HDubé, DGallant, MLacombe, PDeschênes, DRoy, BScheigetz, JBateman, KLi, CTrimble, LADay, SChauret, NNicoll-Griffith, DASilva, JMHuang, ZLaliberté, FLiu, SEthier, DPon, DMuise, EBoulet, LChan, CCStyhler, ACharleson, SMancini, JMasson, PClaveau, DNicholson, DTurner, MYoung, RNGirard, Y Discovery of a substituted 8-arylquinoline series of PDE4 inhibitors: structure-activity relationship, optimization, and identification of a highly potent, well tolerated, PDE4 inhibitor. Bioorg Med Chem Lett 15:5241-6 (2005)  
Target
Name:
cAMP-specific 3',5'-cyclic phosphodiesterase 4B
Synonyms:
3',5'-cyclic phosphodiesterase Isoform PDE4B1 PDE4B PDE4B_HUMAN Phosphodiesterase 4B (PDE4B) Phosphodiesterase Type 4 (PDE4B)
Type:
Protein
Mol. Mass.:
83318.87
Organism:
Homo sapiens (Human)
Description:
Q07343
Residue:
736
  
Inhibitor
Name:
BDBM50174013
Synonyms:
(E)-3-(3-(6-isopropylquinolin-8-yl)phenyl)-2-(4-(methylsulfonyl)phenyl)acrylic acid | CHEMBL197386
Type:
Small organic molecule
Emp. Form.:
C28H25NO4S
Mol. Mass.:
471.567
SMILES:
CC(C)c1cc(-c2cccc(\C=C(\C(O)=O)c3ccc(cc3)S(C)(=O)=O)c2)c2ncccc2c1
: