Target
Muscarinic acetylcholine receptor M2
Ligand
BDBM50165008
Substrate
Meas. Tech.
ChEMBL_327856 (CHEMBL863986)
Ki
4±n/a nM
Citation
 Starck, JPTalaga, PQuéré, LCollart, PChristophe, BLo Brutto, PJadot, SChimmanamada, DZanda, MWagner, AMioskowski, CMassingham, RGuyaux, M Potent anti-muscarinic activity in a novel series of quinuclidine derivatives. Bioorg Med Chem Lett 16:373-7 (2005)  
Target
Name:
Muscarinic acetylcholine receptor M2
Synonyms:
ACM2_HUMAN Cholinergic, muscarinic M2 Muscarinic acetylcholine receptor M2 and M5 | RecName: Full=Muscarinic acetylcholine receptor M2
Type:
GPCR
Mol. Mass.:
51730.61
Organism:
Homo sapiens (Human)
Description:
P08172
Residue:
466
  
Inhibitor
Name:
BDBM50165008
Synonyms:
(+)-(R)-2-(alpha-(2-(Diisopropylamino)ethyl)benzyl)-p-cresol 2-[(1R)-3-(diisopropylamino)-1-phenylpropyl]-4-methylphenol TOLTERODINE
Type:
Small organic molecule
Emp. Form.:
C22H31NO
Mol. Mass.:
325.4876
SMILES:
CC(C)N(CC[C@H](c1ccccc1)c1cc(C)ccc1O)C(C)C
: