Target
Muscarinic acetylcholine receptor M3
Ligand
BDBM50165019
Substrate
Meas. Tech.
ChEMBL_327855 (CHEMBL863985)
Ki
1.3±n/a nM
Citation
 Starck, JPTalaga, PQuéré, LCollart, PChristophe, BLo Brutto, PJadot, SChimmanamada, DZanda, MWagner, AMioskowski, CMassingham, RGuyaux, M Potent anti-muscarinic activity in a novel series of quinuclidine derivatives. Bioorg Med Chem Lett 16:373-7 (2005)  
Target
Name:
Muscarinic acetylcholine receptor M3
Synonyms:
ACM3_HUMAN Cholinergic, muscarinic M3 Muscarinic receptor M3 | RecName: Full=Muscarinic acetylcholine receptor M3
Type:
Enzyme
Mol. Mass.:
66151.03
Organism:
Homo sapiens (Human)
Description:
P20309
Residue:
590
  
Inhibitor
Name:
BDBM50165019
Synonyms:
4-(Diethylamino)-2-butynyl alpha-phenylcyclohexaneglycolic acid ester 4-Diethylamino-2-butinyl alpha-cyclohexylmandelat Benzeneacetic acid, alpha-cyclohexyl-alpha-hydroxy-, 4-(diethylamino)-2-butynyl ester Cyclohexaneglycolic acid, alpha-phenyl-, 4-(diethylamino)-2-butynyl ester | OXYBUTYNIN CHLORIDE
Type:
Small organic molecule
Emp. Form.:
C22H31NO3
Mol. Mass.:
357.4864
SMILES:
CCN(CC)CC#CCOC(=O)C(O)(C1CCCCC1)c1ccccc1
: