Target
Muscarinic acetylcholine receptor M3
Ligand
BDBM50176733
Substrate
Meas. Tech.
ChEMBL_327855 (CHEMBL863985)
Ki
2.5±n/a nM
Citation
 Starck, JPTalaga, PQuéré, LCollart, PChristophe, BLo Brutto, PJadot, SChimmanamada, DZanda, MWagner, AMioskowski, CMassingham, RGuyaux, M Potent anti-muscarinic activity in a novel series of quinuclidine derivatives. Bioorg Med Chem Lett 16:373-7 (2005)  
Target
Name:
Muscarinic acetylcholine receptor M3
Synonyms:
ACM3_HUMAN Cholinergic, muscarinic M3 Muscarinic receptor M3 | RecName: Full=Muscarinic acetylcholine receptor M3
Type:
Enzyme
Mol. Mass.:
66151.03
Organism:
Homo sapiens (Human)
Description:
P20309
Residue:
590
  
Inhibitor
Name:
BDBM50176733
Synonyms:
1-(3-methoxyquinuclidin-3-yl)-3-phenyloct-1-yn-3-ol | CHEMBL199821
Type:
Small organic molecule
Emp. Form.:
C22H31NO2
Mol. Mass.:
341.487
SMILES:
CCCCCC(O)(C#CC1(CN2CCC1CC2)OC)c1ccccc1
: