Target
Sodium- and chloride-dependent GABA transporter 1
Ligand
BDBM50175788
Substrate
Meas. Tech.
ChEMBL_329152 (CHEMBL862288)
IC50
2800±n/a nM
Citation
 Zheng, JWen, RLuo, XLin, GZhang, JXu, LGuo, LJiang, H Design, synthesis, and biological evaluation of the N-diarylalkenyl-piperidinecarboxylic acid derivatives as GABA uptake inhibitors (I). Bioorg Med Chem Lett 16:225-7 (2005)  
Target
Name:
Sodium- and chloride-dependent GABA transporter 1
Synonyms:
GABA transporter 1 GABT1 GAT1 SLC6A1 Solute carrier family 6 member 1
Type:
PROTEIN
Mol. Mass.:
67079.40
Organism:
Homo sapiens (Human)
Description:
ChEMBL_1454196
Residue:
599
  
Inhibitor
Name:
BDBM50175788
Synonyms:
(R)-1-(4,4-bis(3-(methoxymethyl)thiophen-2-yl)but-3-enyl)piperidine-3-carboxylic acid hydrochloride | CHEMBL535829
Type:
Small organic molecule
Emp. Form.:
C22H29NO4S2
Mol. Mass.:
435.6
SMILES:
[#6]-[#8]-[#6]-c1ccsc1\[#6](=[#6]/[#6]-[#6]-[#7]-1-[#6]-[#6]-[#6]-[#6@H](-[#6]-1)-[#6](-[#8])=O)-c1sccc1-[#6]-[#8]-[#6]
: