Target
Mu-type opioid receptor
Ligand
BDBM50180190
Substrate
Meas. Tech.
ChEMBL_330097 (CHEMBL858889)
Ki
0.010000±n/a nM
Citation
 Peng, XKnapp, BIBidlack, JMNeumeyer, JL Synthesis and preliminary in vitro investigation of bivalent ligands containing homo- and heterodimeric pharmacophores at mu, delta, and kappa opioid receptors. J Med Chem 49:256-62 (2006)  
Target
Name:
Mu-type opioid receptor
Synonyms:
M-OR-1 MOR-1 MUOR1 Mu opiate receptor OPRM1 hMOP | mu-type opioid receptor isoform MOR-1
Type:
G Protein-Coupled Receptor (GPCR)
Mol. Mass.:
44789.51
Organism:
Homo sapiens (Human)
Description:
P35372
Residue:
400
  
Inhibitor
Name:
BDBM50180190
Synonyms:
(1R,9R)-17-[(2S)-oxolan-2-ylmethyl]-17-azatetracyclo[7.5.3.0^{1,10}.0^{2,7}]heptadeca-2(7),3,5-trien-4-ol | CHEMBL199832
Type:
Small organic molecule
Emp. Form.:
C21H29NO2
Mol. Mass.:
327.4605
SMILES:
Oc1ccc2C[C@@H]3C4CCCC[C@]4(CCN3C[C@@H]3CCCO3)c2c1
: