Target
Cannabinoid receptor 1
Ligand
BDBM50181831
Substrate
Meas. Tech.
ChEMBL_333218 (CHEMBL858976)
Ki
145±n/a nM
Citation
 Ben-Shabat, SHanus, LOKatzavian, GGallily, R New cannabidiol derivatives: synthesis, binding to cannabinoid receptor, and evaluation of their antiinflammatory activity. J Med Chem 49:1113-7 (2006)  
Target
Name:
Cannabinoid receptor 1
Synonyms:
Brain-type cannabinoid receptor CB-R CNR1_RAT Cannabinoid receptor Cnr1 | Skr6
Type:
G Protein-Coupled Receptor (GPCR)
Mol. Mass.:
52856.55
Organism:
Rattus norvegicus (rat)
Description:
P20272
Residue:
473
  
Inhibitor
Name:
BDBM50181831
Synonyms:
2-((2S)-2-isopropyl-5-methylcyclohexyl)-5-pentylbenzene-1,3-diol | CHEMBL204497
Type:
Small organic molecule
Emp. Form.:
C21H34O2
Mol. Mass.:
318.4935
SMILES:
CCCCCc1cc(O)c(C2CC(C)CC[C@H]2C(C)C)c(O)c1
: