Target
Cannabinoid receptor 1
Ligand
BDBM50181834
Substrate
Meas. Tech.
ChEMBL_333218 (CHEMBL858976)
Ki
17±n/a nM
Citation
 Ben-Shabat, SHanus, LOKatzavian, GGallily, R New cannabidiol derivatives: synthesis, binding to cannabinoid receptor, and evaluation of their antiinflammatory activity. J Med Chem 49:1113-7 (2006)  
Target
Name:
Cannabinoid receptor 1
Synonyms:
Brain-type cannabinoid receptor CB-R CNR1_RAT Cannabinoid receptor Cnr1 | Skr6
Type:
G Protein-Coupled Receptor (GPCR)
Mol. Mass.:
52856.55
Organism:
Rattus norvegicus (rat)
Description:
P20272
Residue:
473
  
Inhibitor
Name:
BDBM50181834
Synonyms:
2-((2S)-2-isopropyl-5-methylcyclohexyl)-5-(2-methyloctan-2-yl)benzene-1,3-diol | CHEMBL201767
Type:
Small organic molecule
Emp. Form.:
C25H42O2
Mol. Mass.:
374.5998
SMILES:
CCCCCCC(C)(C)c1cc(O)c(C2CC(C)CC[C@H]2C(C)C)c(O)c1
: